Reaction Details
Target5-hydroxytryptamine receptor 1F
LigandBDBM50119543
Substrate/Competitorn/a
Meas. Tech.ChEMBL_1518515 (CHEMBL3618901)
Ki 5.1±n/a nM
Citation Zhang, DBlanco, MJYing, BPKohlman, DLiang, SXVictor, FChen, QKrushinski, JFilla, SAHudziak, KJMathes, BMCohen, MPZacherl, DNelson, DLWainscott, DBNutter, SEGough, WHSchaus, JMXu, YC Discovery of selective N-[3-(1-methyl-piperidine-4-carbonyl)-phenyl]-benzamide-based 5-HT1 F receptor agonists: Evolution from bicyclic to monocyclic cores. Bioorg Med Chem Lett25:4337-41 (2015) 
 
5-hydroxytryptamine receptor 1F
Name:5-hydroxytryptamine receptor 1F
Type:Enzyme Catalytic Domain
Mol. Mass.:41724.68
Organism:Homo sapiens (Human)
Description:5-HT1F HTR1F HUMAN::P30939
Residue:366
BDBM50119543
NameBDBM50119543
Synonyms:CHEMBL3617549
TypeSmall organic molecule
Emp. Form.C20H21FN2O2
Mol. Mass.340.3913
SMILESCN1CCC(CC1)C(=O)c1cccc(NC(=O)c2ccc(F)cc2)c1