Reaction Details
TargetSerine racemase
LigandBDBM50119563
Substrate/Competitorn/a
Meas. Tech.ChEMBL_1516972 (CHEMBL3619307)
Ki 1300000±n/a nM
Citation Dellafiora, LMarchetti, MSpyrakis, FOrlandi, VCampanini, BCruciani, GCozzini, PMozzarelli, A Expanding the chemical space of human serine racemase inhibitors. Bioorg Med Chem Lett25:4297-303 (2015) 
 
Serine racemase
Name:Serine racemase
Type:PROTEIN
Mol. Mass.:36565.80
Organism:Homo sapiens (Human)
Description:ChEMBL_1516972
Residue:340
BDBM50119563
NameBDBM50119563
Synonyms:CHEBI:45969 | TRICARBALLYLIC ACID
TypeSmall organic molecule
Emp. Form.C6H8O6
Mol. Mass.176.1241
SMILESOC(=O)CC(CC(O)=O)C(O)=O