Reaction Details
TargetTyrosine-protein kinase HCK
LigandBDBM50119566
Substrate/Competitorn/a
Meas. Tech.ChEMBL_1517136 (CHEMBL3619919)
Ki 980±n/a nM
Citation Kwarcinski, FESteffey, MEFox, CCSoellner, MB Discovery of Bivalent Kinase Inhibitors via Enzyme-Templated Fragment Elaboration. ACS Med Chem Lett6:898-901 (2015) 
 
Tyrosine-protein kinase HCK
Name:Tyrosine-protein kinase HCK
Type:Enzyme Catalytic Domain
Mol. Mass.:59600.18
Organism:Homo sapiens (Human)
Description:P08631
Residue:526
BDBM50119566
NameBDBM50119566
Synonyms:CHEMBL3617732
TypeSmall organic molecule
Emp. Form.C20H23N7O
Mol. Mass.377.4429
SMILESCCCC(=O)Nc1cccc(Nc2nccc(Nc3cc([nH]n3)C3CC3)n2)c1