Reaction Details
TargetProto-oncogene tyrosine-protein kinase Src
LigandBDBM50119569
Substrate/Competitorn/a
Meas. Tech.ChEMBL_1517133 (CHEMBL3619916)
Ki 90±n/a nM
Citation Kwarcinski, FESteffey, MEFox, CCSoellner, MB Discovery of Bivalent Kinase Inhibitors via Enzyme-Templated Fragment Elaboration. ACS Med Chem Lett6:898-901 (2015) 
 
Proto-oncogene tyrosine-protein kinase Src
Name:Proto-oncogene tyrosine-protein kinase Src
Type:Protein
Mol. Mass.:59838.60
Organism:Homo sapiens (Human)
Description:P12931
Residue:536
BDBM50119569
NameBDBM50119569
Synonyms:CHEMBL3617733
TypeSmall organic molecule
Emp. Form.C33H39N9O2S
Mol. Mass.625.787
SMILESCN1CCN(C(C1)c1ccccc1)C(=O)CCSCCC(=O)Nc1cccc(Nc2nccc(Nc3cc([nH]n3)C3CC3)n2)c1