Reaction Details
TargetTyrosine-protein kinase HCK
LigandBDBM50119571
Substrate/Competitorn/a
Meas. Tech.ChEMBL_1517136 (CHEMBL3619919)
Ki>1250000±n/a nM
Citation Kwarcinski, FESteffey, MEFox, CCSoellner, MB Discovery of Bivalent Kinase Inhibitors via Enzyme-Templated Fragment Elaboration. ACS Med Chem Lett6:898-901 (2015) 
 
Tyrosine-protein kinase HCK
Name:Tyrosine-protein kinase HCK
Type:Enzyme Catalytic Domain
Mol. Mass.:59600.18
Organism:Homo sapiens (Human)
Description:P08631
Residue:526
BDBM50119571
NameBDBM50119571
Synonyms:CHEMBL3617729
TypeSmall organic molecule
Emp. Form.C11H13NO2
Mol. Mass.191.2264
SMILESC=CC(=O)N1CCCC1c1ccco1