Reaction Details
TargetMitogen-activated protein kinase 1
LigandBDBM50094464
Substrate/Competitorn/a
Meas. Tech.ChEMBL_1517783 (CHEMBL3620379)
IC50 1.000000±n/a nM
Citation Uehling, DEHarris, PA Recent progress on MAP kinase pathway inhibitors. Bioorg Med Chem Lett25:4047-56 (2015) 
 
Mitogen-activated protein kinase 1
Name:Mitogen-activated protein kinase 1
Type:Ser/Thr Protein Kinase
Mol. Mass.:41392.76
Organism:Homo sapiens (Human)
Description:P28482
Residue:360
BDBM50094464
NameBDBM50094464
Synonyms:CHEMBL3590107 US10934304, Example SCH772984
TypeSmall organic molecule
Emp. Form.C33H33N9O2
Mol. Mass.587.6742
SMILESO=C(CN1CC[C@H](C1)C(=O)Nc1ccc2[nH]nc(-c3ccncc3)c2c1)N1CCN(CC1)c1ccc(cc1)-c1ncccn1