Reaction Details
TargetPhosphatidylinositol 4,5-bisphosphate 3-kinase catalytic subunit alpha isoform
LigandBDBM50119618
Substrate/Competitorn/a
Meas. Tech.ChEMBL_1517784 (CHEMBL3620380)
Ki 8.3±n/a nM
Citation Stec, MMAndrews, KLBo, YCaenepeel, SLiao, HMcCarter, JMullady, ELSan Miguel, TSubramanian, RTamayo, NWhittington, DAWang, LWu, TZalameda, LPZhang, NHughes, PENorman, MH The imidazo[1,2-a]pyridine ring system as a scaffold for potent dual phosphoinositide-3-kinase (PI3K)/mammalian target of rapamycin (mTOR) inhibitors. Bioorg Med Chem Lett25:4136-42 (2015) 
 
Phosphatidylinositol 4,5-bisphosphate 3-kinase catalytic subunit alpha isoform
Name:Phosphatidylinositol 4,5-bisphosphate 3-kinase catalytic subunit alpha isoform
Type:Enzyme Subunit
Mol. Mass.:124294.87
Organism:Homo sapiens (Human)
Description:P42336
Residue:1068
BDBM50119618
NameBDBM50119618
Synonyms:CHEMBL3618242
TypeSmall organic molecule
Emp. Form.C24H29N11O2
Mol. Mass.503.5596
SMILESCOc1ccc(Nc2nc3ccc(cn3c2-c2nc(C)nc(N)n2)N2CCN(CC2)C(=O)N(C)C)cn1