Reaction Details
TargetMuscarinic acetylcholine receptor M1
LigandBDBM50061705
Substrate/Competitorn/a
Meas. Tech.ChEMBL_1517982 (CHEMBL3618687)
EC50 64±n/a nM
Citation Liu, BCroy, CHHitchcock, SAAllen, JRRao, ZEvans, DBures, MGMcKinzie, DLWatt, MLStuart Gregory, GHansen, MMHoogestraat, PJJamison, JAOkha-Mokube, FMStratford, RETurner, WBymaster, FFelder, CC Design and synthesis of N-[6-(Substituted Aminoethylideneamino)-2-Hydroxyindan-1-yl]arylamides as selective and potent muscarinic M1 agonists. Bioorg Med Chem Lett25:4158-63 (2015) 
 
Muscarinic acetylcholine receptor M1
Name:Muscarinic acetylcholine receptor M1
Type:Protein
Mol. Mass.:51442.54
Organism:Homo sapiens (Human)
Description:P11229
Residue:460
BDBM50061705
NameBDBM50061705
Synonyms:(R)-1-Aza-bicyclo[2.2.2]oct-3-yl-[(Z)-methoxyimino]-acetonitrile SB-202026
TypeSmall organic molecule
Emp. Form.C10H15N3O
Mol. Mass.193.2456
SMILESCO\N=C(/C#N)[C@H]1CN2CCC1CC2