Reaction Details
TargetMuscarinic acetylcholine receptor M3
LigandBDBM10759
Substrate/Competitorn/a
Meas. Tech.ChEMBL_1517986 (CHEMBL3618843)
EC50 205±n/a nM
Citation Liu, BCroy, CHHitchcock, SAAllen, JRRao, ZEvans, DBures, MGMcKinzie, DLWatt, MLStuart Gregory, GHansen, MMHoogestraat, PJJamison, JAOkha-Mokube, FMStratford, RETurner, WBymaster, FFelder, CC Design and synthesis of N-[6-(Substituted Aminoethylideneamino)-2-Hydroxyindan-1-yl]arylamides as selective and potent muscarinic M1 agonists. Bioorg Med Chem Lett25:4158-63 (2015) 
 
Muscarinic acetylcholine receptor M3
Name:Muscarinic acetylcholine receptor M3
Type:Enzyme
Mol. Mass.:66151.03
Organism:Homo sapiens (Human)
Description:P20309
Residue:590
BDBM10759
NameBDBM10759
Synonyms:2-acetoxyethyl(trimethyl)ammonium;bromide CHEMBL667 [2-(acetyloxy)ethyl]trimethylazanium acetylcholine chloride | cid_6060
TypeSmall Organic Molecule
Emp. Form.C7H16NO2
Mol. Mass.146.2069
SMILESCC(=O)OCC[N+](C)(C)C