Reaction Details
TargetCCR4-NOT transcription complex subunit 7
LigandBDBM50119651
Substrate/Competitorn/a
Meas. Tech.ChEMBL_1518114 (CHEMBL3619397)
IC50 10400±n/a nM
Citation Jadhav, GPKaur, IMaryati, MAirhihen, BFischer, PMWinkler, GS Discovery, synthesis and biochemical profiling of purine-2,6-dione derivatives as inhibitors of the human poly(A)-selective ribonuclease Caf1. Bioorg Med Chem Lett25:4219-24 (2015) 
 
CCR4-NOT transcription complex subunit 7
Name:CCR4-NOT transcription complex subunit 7
Type:PROTEIN
Mol. Mass.:32730.66
Organism:Homo sapiens (Human)
Description:ChEMBL_109881
Residue:285
BDBM50119651
NameBDBM50119651
Synonyms:CHEMBL3616505
TypeSmall organic molecule
Emp. Form.C12H10N4O3
Mol. Mass.258.2328
SMILESOn1c(=O)[nH]c2ncn(Cc3ccccc3)c2c1=O