Reaction Details
TargetAcetylcholine-binding protein
LigandBDBM82070
Substrate/Competitorn/a
Meas. Tech.ChEMBL_1518279 (CHEMBL3620254)
Kd 320±n/a nM
Citation Bach, TBJensen, AAPetersen, JGSørensen, TEDella Volpe, SLiu, JBlaazer, ARvan Muijlwijk-Koezen, JEBalle, TFrølund, B Exploration of the molecular architecture of the orthosteric binding site in thea4ß2 nicotinic acetylcholine receptor with analogs of 3-(dimethylamino)butyl dimethylcarbamate (DMABC) and 1-(pyridin-3-yl)-1,4-diazepane. Eur J Med Chem102:425-44 (2015) 
 
Acetylcholine-binding protein
Name:Acetylcholine-binding protein
Type:n/a
Mol. Mass.:26055.52
Organism:Lymnaea stagnalis
Description:Soluble acetylcholine receptor
Residue:229
BDBM82070
NameBDBM82070
Synonyms:CAS_29790-52-1 Nicotine-D salicylate US9303017, Nicotine
Typen/a
Emp. Form.C10H14N2
Mol. Mass.162.2316
SMILESCN1CCC[C@H]1c1cccnc1