Reaction Details
TargetGlucagon receptor
LigandBDBM50120370
Substrate/Competitorn/a
Meas. Tech.ChEMBL_1518284 (CHEMBL3620259)
IC50 4.0±n/a nM
Citation Lin, SZhang, FJiang, GQureshi, SAYang, XChicchi, GGTota, LBansal, ABrady, ETrujillo, MSalituro, GMiller, CTata, JRZhang, BBParmee, ER A novel series of indazole-/indole-based glucagon receptor antagonists. Bioorg Med Chem Lett25:4143-7 (2015) 
 
Glucagon receptor
Name:Glucagon receptor
Type:Enzyme
Mol. Mass.:54026.92
Organism:Homo sapiens (Human)
Description:P47871
Residue:477
BDBM50120370
NameBDBM50120370
Synonyms:CHEMBL3616697
TypeSmall organic molecule
Emp. Form.C35H34F3N3O4S
Mol. Mass.649.722
SMILESCCCCC(c1ccc(cc1)C(=O)NCCC(O)=O)n1nc(-c2cc(ccc2OC)C(F)(F)F)c2ccc(cc12)-c1ccc(C)s1