Reaction Details
TargetNeutrophil elastase
LigandBDBM50118028
Substrate/Competitorn/a
Meas. Tech.ChEMBL_1517831 (CHEMBL3620522)
Ki 0.160000±n/a nM
Citation von Nussbaum, FLi, VM Neutrophil elastase inhibitors for the treatment of (cardio)pulmonary diseases: Into clinical testing with pre-adaptive pharmacophores. Bioorg Med Chem Lett25:4370-81 (2015) 
 
Neutrophil elastase
Name:Neutrophil elastase
Type:Enzyme
Mol. Mass.:28532.38
Organism:Homo sapiens (Human)
Description:P08246
Residue:267
BDBM50118028
NameBDBM50118028
Synonyms:3-Isopropyl-1-methanesulfonyl-4-(2-pyrrolidin-1-ylmethyl-oxazole-4-carbonyl)-hexahydro-pyrrolo[3,2-b]pyrrol-2-one; hydrochloride | CHEMBL542949
TypeSmall organic molecule
Emp. Form.C19H28N4O5S
Mol. Mass.424.514
SMILESCC(C)[C@H]1[C@H]2[C@@H](CCN2C(=O)c2coc(CN3CCCC3)n2)N(C1=O)S(C)(=O)=O