Reaction Details
TargetCytochrome P450 26A1
LigandBDBM50342128
Substrate/Competitorn/a
Meas. Tech.ChEMBL_1517856 (CHEMBL3620652)
IC50 3.0±n/a nM
Citation Sun, BLiu, KHan, JZhao, LYSu, XLin, BZhao, DMCheng, MS Design, synthesis, and biological evaluation of amide imidazole derivatives as novel metabolic enzyme CYP26A1 inhibitors. Bioorg Med Chem23:6763-73 (2015) 
 
Cytochrome P450 26A1
Name:Cytochrome P450 26A1
Type:Enzyme
Mol. Mass.:56216.16
Organism:Homo sapiens (Human)
Description:O43174
Residue:497
BDBM50342128
NameBDBM50342128
Synonyms:3-Imidazol-1-yl-2-methyl-3-[4-(naphthalen-2-ylamino)-phenyl]-propionicAcid Methyl Ester | CHEMBL1766005
TypeSmall organic molecule
Emp. Form.C25H25N3O2
Mol. Mass.399.4849
SMILESCOC(=O)C(C)(C)C(c1ccc(Nc2ccc3ccccc3c2)cc1)n1ccnc1