Reaction Details
TargetBifunctional epoxide hydrolase 2
LigandBDBM50269016
Substrate/Competitorn/a
Meas. Tech.ChEMBL_1517873 (CHEMBL3620669)
IC50 37400±n/a nM
Citation Sun, YNKim, JHLi, WJo, ARYan, XTYang, SYKim, YH Soluble epoxide hydrolase inhibitory activity of anthraquinone components from Aloe. Bioorg Med Chem23:6659-65 (2015) 
 
Bifunctional epoxide hydrolase 2
Name:Bifunctional epoxide hydrolase 2
Type:Enzyme
Mol. Mass.:62613.07
Organism:Homo sapiens (Human)
Description:P34913
Residue:555
BDBM50269016
NameBDBM50269016
Synonyms:CHEMBL497001 | aloin
TypeSmall organic molecule
Emp. Form.C21H22O9
Mol. Mass.418.394
SMILESOC[C@H]1O[C@H]([C@H](O)[C@@H](O)[C@@H]1O)C1c2cccc(O)c2C(=O)c2c(O)cc(CO)cc12