Reaction Details
TargetBifunctional epoxide hydrolase 2
LigandBDBM50120494
Substrate/Competitorn/a
Meas. Tech.ChEMBL_1517874 (CHEMBL3620670)
Ki 15500±n/a nM
Citation Sun, YNKim, JHLi, WJo, ARYan, XTYang, SYKim, YH Soluble epoxide hydrolase inhibitory activity of anthraquinone components from Aloe. Bioorg Med Chem23:6659-65 (2015) 
 
Bifunctional epoxide hydrolase 2
Name:Bifunctional epoxide hydrolase 2
Type:Enzyme
Mol. Mass.:62613.07
Organism:Homo sapiens (Human)
Description:P34913
Residue:555
BDBM50120494
NameBDBM50120494
Synonyms:CHEMBL3617999
TypeSmall organic molecule
Emp. Form.C36H30O14
Mol. Mass.686.615
SMILES[H][C@]1(O[C@H](CO)[C@@H](O)[C@H](O)[C@H]1O)[C@@]1(c2ccc3C(=O)c4cc(CO)cc(O)c4C(=O)c3c2O)c2cccc(O)c2C(=O)c2c(O)cc(CO)cc12