Reaction Details
TargetSphingosine 1-phosphate receptor 2
LigandBDBM50120582
Substrate/Competitorn/a
Meas. Tech.ChEMBL_1518043 (CHEMBL3619044)
IC50 39±n/a nM
Citation Kusumi, KShinozaki, KYamaura, YHashimoto, AKurata, HNaganawa, AUeda, HOtsuki, KMatsushita, TSekiguchi, TKakuuchi, ASeko, T Discovery of novel S1P2 antagonists. Part 2: Improving the profile of a series of 1,3-bis(aryloxy)benzene derivatives. Bioorg Med Chem Lett25:4387-92 (2015) 
 
Sphingosine 1-phosphate receptor 2
Name:Sphingosine 1-phosphate receptor 2
Type:G Protein-Coupled Receptor (GPCR)
Mol. Mass.:38883.16
Organism:Homo sapiens (Human)
Description:Membranes isolated from S1P2-transfected CHO cells were used in ligand binding assay.
Residue:353
BDBM50120582
NameBDBM50120582
Synonyms:CHEMBL3618199
TypeSmall organic molecule
Emp. Form.C31H28F2N2O6S
Mol. Mass.594.626
SMILESCS(=O)(=O)c1ccc(Oc2cc(NC(=O)N3CCC(O)(CC3)c3ccc(F)cc3)cc(Oc3ccc(F)cc3)c2)cc1