Reaction Details
TargetMyosin light chain kinase, smooth muscle
LigandBDBM50120599
Substrate/Competitorn/a
Meas. Tech.ChEMBL_1518061 (CHEMBL3619062)
IC50 31300±n/a nM
Citation Chikhale, RThorat, SPant, AJadhav, AThatipamula, KCBansode, RBhargavi, GKarodia, NRajasekharan, MVParadkar, AKhedekar, P Design, synthesis and pharmacological evaluation of pyrimidobenzothiazole-3-carboxylate derivatives as selective L-type calcium channel blockers. Bioorg Med Chem23:6689-713 (2015) 
 
Myosin light chain kinase, smooth muscle
Name:Myosin light chain kinase, smooth muscle
Type:Protein
Mol. Mass.:210702.56
Organism:Homo sapiens (Human)
Description:Q15746
Residue:1914
BDBM50120599
NameBDBM50120599
Synonyms:CHEMBL558460
TypeSmall organic molecule
Emp. Form.C23H25ClN2O4
Mol. Mass.428.909
SMILESCCOC(=O)C1=C(C)NC(OC)N(CC(=O)c2ccccc2)C1c1ccc(Cl)cc1