Reaction Details
TargetMyosin light chain kinase, smooth muscle
LigandBDBM50120605
Substrate/Competitorn/a
Meas. Tech.ChEMBL_1518061 (CHEMBL3619062)
IC50 9100±n/a nM
Citation Chikhale, RThorat, SPant, AJadhav, AThatipamula, KCBansode, RBhargavi, GKarodia, NRajasekharan, MVParadkar, AKhedekar, P Design, synthesis and pharmacological evaluation of pyrimidobenzothiazole-3-carboxylate derivatives as selective L-type calcium channel blockers. Bioorg Med Chem23:6689-713 (2015) 
 
Myosin light chain kinase, smooth muscle
Name:Myosin light chain kinase, smooth muscle
Type:Protein
Mol. Mass.:210702.56
Organism:Homo sapiens (Human)
Description:Q15746
Residue:1914
BDBM50120605
NameBDBM50120605
Synonyms:CHEMBL3618282
TypeSmall organic molecule
Emp. Form.C19H15ClN2OS
Mol. Mass.354.853
SMILESCC(=O)C1=C(C)N=C2Sc3ccccc3N2C1c1ccc(Cl)cc1