Reaction Details
TargetMyosin light chain kinase, smooth muscle
LigandBDBM50120620
Substrate/Competitorn/a
Meas. Tech.ChEMBL_1518061 (CHEMBL3619062)
IC50 46700000±n/a nM
Citation Chikhale, RThorat, SPant, AJadhav, AThatipamula, KCBansode, RBhargavi, GKarodia, NRajasekharan, MVParadkar, AKhedekar, P Design, synthesis and pharmacological evaluation of pyrimidobenzothiazole-3-carboxylate derivatives as selective L-type calcium channel blockers. Bioorg Med Chem23:6689-713 (2015) 
 
Myosin light chain kinase, smooth muscle
Name:Myosin light chain kinase, smooth muscle
Type:Protein
Mol. Mass.:210702.56
Organism:Homo sapiens (Human)
Description:Q15746
Residue:1914
BDBM50120620
NameBDBM50120620
Synonyms:CHEMBL3618286
TypeSmall organic molecule
Emp. Form.C20H18N2O2S
Mol. Mass.350.434
SMILESCOc1ccc(cc1)C1N2C(Sc3ccccc23)=NC(C)=C1C(C)=O