Reaction Details
TargetMyosin light chain kinase, smooth muscle
LigandBDBM50120607
Substrate/Competitorn/a
Meas. Tech.ChEMBL_1518061 (CHEMBL3619062)
IC50 22800000±n/a nM
Citation Chikhale, RThorat, SPant, AJadhav, AThatipamula, KCBansode, RBhargavi, GKarodia, NRajasekharan, MVParadkar, AKhedekar, P Design, synthesis and pharmacological evaluation of pyrimidobenzothiazole-3-carboxylate derivatives as selective L-type calcium channel blockers. Bioorg Med Chem23:6689-713 (2015) 
 
Myosin light chain kinase, smooth muscle
Name:Myosin light chain kinase, smooth muscle
Type:Protein
Mol. Mass.:210702.56
Organism:Homo sapiens (Human)
Description:Q15746
Residue:1914
BDBM50120607
NameBDBM50120607
Synonyms:CHEMBL3618289
TypeSmall organic molecule
Emp. Form.C21H21N3OS
Mol. Mass.363.476
SMILESCN(C)c1ccc(cc1)C1N2C(Sc3ccccc23)=NC(C)=C1C(C)=O