Reaction Details
TargetMyosin light chain kinase, smooth muscle
LigandBDBM50120615
Substrate/Competitorn/a
Meas. Tech.ChEMBL_1518061 (CHEMBL3619062)
IC50 27200000±n/a nM
Citation Chikhale, RThorat, SPant, AJadhav, AThatipamula, KCBansode, RBhargavi, GKarodia, NRajasekharan, MVParadkar, AKhedekar, P Design, synthesis and pharmacological evaluation of pyrimidobenzothiazole-3-carboxylate derivatives as selective L-type calcium channel blockers. Bioorg Med Chem23:6689-713 (2015) 
 
Myosin light chain kinase, smooth muscle
Name:Myosin light chain kinase, smooth muscle
Type:Protein
Mol. Mass.:210702.56
Organism:Homo sapiens (Human)
Description:Q15746
Residue:1914
BDBM50120615
NameBDBM50120615
Synonyms:CHEMBL3618290
TypeSmall organic molecule
Emp. Form.C20H18N2O3S
Mol. Mass.366.434
SMILESCOc1cc(ccc1O)C1N2C(Sc3ccccc23)=NC(C)=C1C(C)=O