Reaction Details
TargetMelanin-concentrating hormone receptor 1
LigandBDBM50120629
Substrate/Competitorn/a
Meas. Tech.ChEMBL_1518498 (CHEMBL3618884)
IC50 44±n/a nM
Citation Devasthale, PWang, WMignone, JRenduchintala, KRadhakrishnan, SDhanapal, JSelvaraj, JKuppusamy, RPelleymounter, MALonghi, DHuang, NFlynn, NAzzara, AVRohrbach, KDevenny, JRooney, SThomas, MGlick, SGodonis, HHarvey, SCullen, MJZhang, HCaporuscio, CStetsko, PGrubb, MHuang, CZhang, LFreeden, CMurphy, BJRobl, JAWashburn, WN Non-basic azolotriazinone MCHR1 antagonists for the treatment of obesity: An empirical brain-exposures-driven candidate selection for in vivo efficacy studies. Bioorg Med Chem Lett25:4412-8 (2015) 
 
Melanin-concentrating hormone receptor 1
Name:Melanin-concentrating hormone receptor 1
Type:G Protein-Coupled Receptor (GPCR)
Mol. Mass.:45976.27
Organism:Homo sapiens (Human)
Description:Membranes from CHO-K1 cells stably expressing human MCH1R were used in assays.
Residue:422
BDBM50120629
NameBDBM50120629
Synonyms:CHEMBL3618336
TypeSmall organic molecule
Emp. Form.C23H22ClN3O4
Mol. Mass.439.891
SMILESCOc1cc(ccc1OCC(C)(C)O)-n1cnn2cc(cc2c1=O)-c1ccc(Cl)cc1