Reaction Details
TargetMelanin-concentrating hormone receptor 1
LigandBDBM50120729
Substrate/Competitorn/a
Meas. Tech.ChEMBL_1518193 (CHEMBL3619840)
Ki 6.5±n/a nM
Citation Devasthale, PWang, WMignone, JRenduchintala, KRadhakrishnan, SDhanapal, JSelvaraj, JKuppusamy, RPelleymounter, MALonghi, DHuang, NFlynn, NAzzara, AVRohrbach, KDevenny, JRooney, SThomas, MGlick, SGodonis, HHarvey, SCullen, MJZhang, HCaporuscio, CStetsko, PGrubb, MHuang, CZhang, LFreeden, CMurphy, BJRobl, JAWashburn, WN Non-basic azolotriazinone MCHR1 antagonists for the treatment of obesity: An empirical brain-exposures-driven candidate selection for in vivo efficacy studies. Bioorg Med Chem Lett25:4412-8 (2015) 
 
Melanin-concentrating hormone receptor 1
Name:Melanin-concentrating hormone receptor 1
Type:Enzyme Catalytic Domain
Mol. Mass.:39075.64
Organism:RAT
Description:Melanin Concentrating Hormone 1 GPR24 RAT::P97639
Residue:353
BDBM50120729
NameBDBM50120729
Synonyms:CHEMBL3618345
TypeSmall organic molecule
Emp. Form.C23H19ClF2N4O4
Mol. Mass.488.871
SMILESCOc1cc(ccc1OCC1(O)CC(F)(F)C1)-n1cnn2cc(cc2c1=O)-c1ccc(Cl)cn1