Reaction Details
TargetPancreatic alpha-amylase
LigandBDBM50120840
Substrate/Competitorn/a
Meas. Tech.ChEMBL_1516326 (CHEMBL3618918)
Ki 18000000±n/a nM
Citation Al-Asri, JFazekas, ELehoczki, GPerdih, AGörick, CMelzig, MFGyémánt, GWolber, GMortier, J From carbohydrates to drug-like fragments: Rational development of novela-amylase inhibitors. Bioorg Med Chem23:6725-32 (2015) 
 
Pancreatic alpha-amylase
Name:Pancreatic alpha-amylase
Type:Protein
Mol. Mass.:57709.71
Organism:Homo sapiens (Human)
Description:n/a
Residue:511
BDBM50120840
NameBDBM50120840
Synonyms:CHEMBL1213470
TypeSmall organic molecule
Emp. Form.C6H12N2O5
Mol. Mass.192.1699
SMILESOC[C@H]1N\C(=N\O)[C@H](O)[C@@H](O)[C@@H]1O