Reaction Details
TargetPancreatic alpha-amylase
LigandBDBM50120842
Substrate/Competitorn/a
Meas. Tech.ChEMBL_1516316 (CHEMBL3618756)
Ki 15±n/a nM
Citation Al-Asri, JFazekas, ELehoczki, GPerdih, AGörick, CMelzig, MFGyémánt, GWolber, GMortier, J From carbohydrates to drug-like fragments: Rational development of novela-amylase inhibitors. Bioorg Med Chem23:6725-32 (2015) 
 
Pancreatic alpha-amylase
Name:Pancreatic alpha-amylase
Type:Protein
Mol. Mass.:57709.71
Organism:Homo sapiens (Human)
Description:n/a
Residue:511
BDBM50120842
NameBDBM50120842
Synonyms:CHEMBL3618489
TypeSmall organic molecule
Emp. Form.C56H94N2O40
Mol. Mass.1435.335
SMILES[H][C@]1(O[C@@H]2[C@@H](CO)O[C@H](O[C@]3([H])[C@@H](CO)O[C@H](O[C@]4([H])[C@@H](CO)O[C@H](O[C@]5([H])[C@@H](CO)O[C@H](O)[C@H](O)[C@H]5O)[C@H](O)[C@H]4O)[C@H](O)[C@H]3O)[C@H](O)[C@H]2O)O[C@H](C)[C@@H](N[C@H]2C=C(CO)[C@@H](O[C@@]3([H])O[C@H](CO)[C@@H](O[C@@]4([H])O[C@H](C)[C@@H](N[C@H]5C=C(CO)[C@@H](O)[C@H](O)[C@H]5O)[C@H](O)[C@H]4O)[C@H](O)[C@H]3O)[C@H](O)[C@H]2O)[C@H](O)[C@H]1O