Reaction Details
TargetPancreatic alpha-amylase
LigandBDBM50120847
Substrate/Competitorn/a
Meas. Tech.ChEMBL_1516315 (CHEMBL3618755)
IC50 2590±n/a nM
Citation Al-Asri, JFazekas, ELehoczki, GPerdih, AGörick, CMelzig, MFGyémánt, GWolber, GMortier, J From carbohydrates to drug-like fragments: Rational development of novela-amylase inhibitors. Bioorg Med Chem23:6725-32 (2015) 
 
Pancreatic alpha-amylase
Name:Pancreatic alpha-amylase
Type:Protein
Mol. Mass.:57709.71
Organism:Homo sapiens (Human)
Description:n/a
Residue:511
BDBM50120847
NameBDBM50120847
Synonyms:CHEMBL3618487
TypeSmall organic molecule
Emp. Form.C31H53NO23
Mol. Mass.807.7454
SMILESC[C@H]1O[C@H](O[C@@H]2[C@@H](CO)O[C@H](O)[C@H](O)[C@H]2O)[C@H](O)[C@@H](O)[C@@H]1NC1=C[C@H](CO)[C@@H](O[C@H]2O[C@H](CO)[C@@H](O[C@H]3O[C@H](CO)[C@@H](O)[C@H](O)[C@H]3O)[C@H](O)[C@H]2O)[C@H](O)[C@H]1O