Reaction Details
TargetPancreatic alpha-amylase
LigandBDBM50120854
Substrate/Competitorn/a
Meas. Tech.ChEMBL_1516321 (CHEMBL3618913)
Ki 8.0±n/a nM
Citation Al-Asri, JFazekas, ELehoczki, GPerdih, AGörick, CMelzig, MFGyémánt, GWolber, GMortier, J From carbohydrates to drug-like fragments: Rational development of novela-amylase inhibitors. Bioorg Med Chem23:6725-32 (2015) 
 
Pancreatic alpha-amylase
Name:Pancreatic alpha-amylase
Type:Protein
Mol. Mass.:57709.71
Organism:Homo sapiens (Human)
Description:n/a
Residue:511
BDBM50120854
NameBDBM50120854
Synonyms:CHEMBL3618493
TypeSmall organic molecule
Emp. Form.C54H66O32
Mol. Mass.1227.0826
SMILESC[C@@H]1O[C@@H](O[C@@H]2CO[C@@H](Oc3c(O)cc(cc3O)C3=C(O[C@@H]4O[C@@H](C)[C@H](O)[C@@H](O)[C@H]4O[C@@H]4O[C@H](COC(=O)\C=C\c5ccc(O)c(O)c5)[C@@H](O)[C@H](O)[C@H]4O[C@@H]4O[C@H](CO)[C@@H](O)[C@H](O)[C@H]4O)C(=O)c4c(O)cc(O)cc4C3)[C@H](O)[C@H]2O)[C@H](O)[C@H](O)[C@H]1O