Reaction Details
TargetOrexin receptor type 2
LigandBDBM50318697
Substrate/Competitorn/a
Meas. Tech.ChEMBL_1520596 (CHEMBL3625144)
Ki 1.8±n/a nM
Citation Roecker, AJMercer, SPBergman, JMGilbert, KFKuduk, SDHarrell, CMGarson, SLFox, SVGotter, ALTannenbaum, PLPrueksaritanont, TCabalu, TDCui, DLemaire, WWinrow, CJRenger, JJColeman, PJ Discovery of diazepane amide DORAs and 2-SORAs enabled by exploration of isosteric quinazoline replacements. Bioorg Med Chem Lett25:4992-9 (2015) 
 
Orexin receptor type 2
Name:Orexin receptor type 2
Type:Protein
Mol. Mass.:50710.53
Organism:Homo sapiens (Human)
Description:O43614
Residue:444
BDBM50318697
NameBDBM50318697
Synonyms:6-Fluoro-2-{(5R)-5-Methyl-4-[5-methyl-2-(2H-1,2,3-triazol-2-yl)benzoyl]-1,4-diazepan-1-yl}quinazoline | CHEMBL1083358
TypeSmall organic molecule
Emp. Form.C23H22FN7O
Mol. Mass.431.4655
SMILESC[C@@H]1CCN(CCN1C(=O)c1ccccc1-n1nccn1)c1ncc2cc(F)ccc2n1