Reaction Details
TargetPotassium voltage-gated channel subfamily KQT member 4
LigandBDBM50121051
Substrate/Competitorn/a
Meas. Tech.ChEMBL_1520990 (CHEMBL3624294)
EC50 376±n/a nM
Citation Davoren, JEClaffey, MMSnow, SLReese, MRArora, GButler, CRBoscoe, BPChenard, LDeNinno, SLDrozda, SEDuplantier, AJMoine, LRogers, BNRong, SSchuyten, KWright, ASZhang, LSerpa, KAWeber, MLStolyar, PWhisman, TLBaker, KTse, KClark, AJRong, HMather, RJLowe, JA Discovery of a novel Kv7 channel opener as a treatment for epilepsy. Bioorg Med Chem Lett25:4941-4 (2015) 
 
Potassium voltage-gated channel subfamily KQT member 4
Name:Potassium voltage-gated channel subfamily KQT member 4
Type:PROTEIN
Mol. Mass.:18856.39
Organism:Rattus norvegicus
Description:ChEMBL_109898
Residue:168
BDBM50121051
NameBDBM50121051
Synonyms:CHEMBL3621437
TypeSmall organic molecule
Emp. Form.C18H30N4O4
Mol. Mass.366.4552
SMILESCOC1CCN(CC1)c1nc(OC)c(NC(=O)CC(C)(C)C)c(OC)n1