Reaction Details
TargetHistamine H4 receptor
LigandBDBM50121205
Substrate/Competitorn/a
Meas. Tech.ChEMBL_1521716 (CHEMBL3626539)
Ki 42±n/a nM
Citation Tichenor, MSThurmond, RLVenable, JDSavall, BM Functional Profiling of 2-Aminopyrimidine Histamine H4 Receptor Modulators. J Med Chem58:7119-27 (2015) 
 
Histamine H4 receptor
Name:Histamine H4 receptor
Type:G Protein-Coupled Receptor (GPCR)
Mol. Mass.:44272.75
Organism:Mus musculus (mouse)
Description:Cell pellets from SK-N-MC cells transfected with mouse H4 receptor were used in binding assay.
Residue:391
BDBM50121205
NameBDBM50121205
Synonyms:CHEBI:18295 | Histamine
TypeSmall organic molecule
Emp. Form.C5H9N3
Mol. Mass.111.1451
SMILESNCCc1c[nH]cn1