Reaction Details
TargetHistamine H4 receptor
LigandBDBM50356884
Substrate/Competitorn/a
Meas. Tech.ChEMBL_1521718 (CHEMBL3626541)
Ki 6.2±n/a nM
Citation Tichenor, MSThurmond, RLVenable, JDSavall, BM Functional Profiling of 2-Aminopyrimidine Histamine H4 Receptor Modulators. J Med Chem58:7119-27 (2015) 
 
Histamine H4 receptor
Name:Histamine H4 receptor
Type:G Protein-Coupled Receptor (GPCR)
Mol. Mass.:44517.02
Organism:Homo sapiens (Human)
Description:Binding assays were using CHO cells stably expressing hH4R receptors.
Residue:390
BDBM50356884
NameBDBM50356884
Synonyms:CHEMBL1915540
TypeSmall organic molecule
Emp. Form.C13H22N6
Mol. Mass.262.354
SMILESCN[C@@H]1CCN(C1)c1cc(NCC2CC2)nc(N)n1