Reaction Details
TargetHistamine H4 receptor
LigandBDBM50006789
Substrate/Competitorn/a
Meas. Tech.ChEMBL_1521725 (CHEMBL3626548)
Ki 5.3±n/a nM
Citation Tichenor, MSThurmond, RLVenable, JDSavall, BM Functional Profiling of 2-Aminopyrimidine Histamine H4 Receptor Modulators. J Med Chem58:7119-27 (2015) 
 
Histamine H4 receptor
Name:Histamine H4 receptor
Type:G Protein-Coupled Receptor (GPCR)
Mol. Mass.:44272.75
Organism:Mus musculus (mouse)
Description:Cell pellets from SK-N-MC cells transfected with mouse H4 receptor were used in binding assay.
Residue:391
BDBM50006789
NameBDBM50006789
Synonyms:CHEMBL3236549
TypeSmall organic molecule
Emp. Form.C11H19N5
Mol. Mass.221.3021
SMILESCC(C)c1cc(nc(N)n1)N1CC[C@@H](N)C1