Reaction Details
TargetHistamine receptor H4
LigandBDBM50006789
Substrate/Competitorn/a
Meas. Tech.ChEMBL_1521728 (CHEMBL3626551)
Ki 306±n/a nM
Citation Tichenor, MSThurmond, RLVenable, JDSavall, BM Functional Profiling of 2-Aminopyrimidine Histamine H4 Receptor Modulators. J Med Chem58:7119-27 (2015) 
 
Histamine receptor H4
Name:Histamine receptor H4
Type:Enzyme Catalytic Domain
Mol. Mass.:44536.99
Organism:GUINEA PIG
Description:HISTAMINE H4 HRH4 GUINEA PIG::Q91ZY3
Residue:389
BDBM50006789
NameBDBM50006789
Synonyms:CHEMBL3236549
TypeSmall organic molecule
Emp. Form.C11H19N5
Mol. Mass.221.3021
SMILESCC(C)c1cc(nc(N)n1)N1CC[C@@H](N)C1