Reaction Details
TargetCarbonic anhydrase 1
LigandBDBM26980
Substrate/Competitorn/a
Meas. Tech.ChEMBL_1521734 (CHEMBL3626557)
Ki 4000000±n/a nM
Citation Mahon, BPDíaz-Torres, NAPinard, MATu, CSilverman, DNScott, KMMcKenna, R Activity and anion inhibition studies of thea-carbonic anhydrase from Thiomicrospira crunogena XCL-2 Gammaproteobacterium. Bioorg Med Chem Lett25:4937-40 (2015) 
 
Carbonic anhydrase 1
Name:Carbonic anhydrase 1
Type:Enzyme
Mol. Mass.:28873.37
Organism:Homo sapiens (Human)
Description:P00915
Residue:261
BDBM26980
NameBDBM26980
Synonyms:Br- CHEMBL1644694 bromide ion
TypeIon
Emp. Form.Br
Mol. Mass.79.905
SMILES[Br-]