Reaction Details
Target5-hydroxytryptamine receptor 6
LigandBDBM34141
Substrate/Competitorn/a
Meas. Tech.ChEMBL_1521772 (CHEMBL3626595)
Ki 2.3±n/a nM
Citation Karila, DFreret, TBouet, VBoulouard, MDallemagne, PRochais, C Therapeutic Potential of 5-HT6 Receptor Agonists. J Med Chem58:7901-12 (2015) 
 
5-hydroxytryptamine receptor 6
Name:5-hydroxytryptamine receptor 6
Type:G Protein-Coupled Receptor (GPCR)
Mol. Mass.:46968.43
Organism:Homo sapiens (Human)
Description:P50406
Residue:440
BDBM34141
NameBDBM34141
Synonyms:CHEMBL76237 | MS-245
TypeSmall organic molecule
Emp. Form.C19H22N2O3S
Mol. Mass.358.455
SMILESCOc1ccc2n(cc(CCN(C)C)c2c1)S(=O)(=O)c1ccccc1