Reaction Details
Target5-hydroxytryptamine receptor 6
LigandBDBM21358
Substrate/Competitorn/a
Meas. Tech.ChEMBL_1521956 (CHEMBL3626980)
Ki 2.0±n/a nM
Citation Karila, DFreret, TBouet, VBoulouard, MDallemagne, PRochais, C Therapeutic Potential of 5-HT6 Receptor Agonists. J Med Chem58:7901-12 (2015) 
 
5-hydroxytryptamine receptor 6
Name:5-hydroxytryptamine receptor 6
Type:G Protein-Coupled Receptor (GPCR)
Mol. Mass.:46968.43
Organism:Homo sapiens (Human)
Description:P50406
Residue:440
BDBM21358
NameBDBM21358
Synonyms:2-[1-({6-chloroimidazo[2,1-b][1,3]thiazole-5-}sulfonyl)-1H-indol-3-yl]ethan-1-amine SAX-187 | WAY-181187
TypeSmall organic molecule
Emp. Form.C15H13ClN4O2S2
Mol. Mass.380.872
SMILESNCCc1cn(c2ccccc12)S(=O)(=O)c1c(Cl)nc2sccn12