Reaction Details
TargetD(2) dopamine receptor
LigandBDBM50121335
Substrate/Competitorn/a
Meas. Tech.ChEMBL_1522246 (CHEMBL3626475)
Ki 51±n/a nM
Citation Stucchi, MGmeiner, PHuebner, HRainoldi, GSacchetti, ASilvani, ALesma, G Multicomponent Synthesis and Biological Evaluation of a Piperazine-Based Dopamine Receptor Ligand Library. ACS Med Chem Lett6:882-7 (2015) 
 
D(2) dopamine receptor
Name:D(2) dopamine receptor
Type:Cell-surface receptors
Mol. Mass.:50647.10
Organism:Homo sapiens (Human)
Description:P14416
Residue:443
BDBM50121335
NameBDBM50121335
Synonyms:CHEMBL3622099
TypeSmall organic molecule
Emp. Form.C25H33BrN4
Mol. Mass.469.46
SMILESCCCN(CCN1CCN(CCc2c[nH]c3ccccc23)CC1)c1ccc(Br)cc1