Reaction Details
TargetD(3) dopamine receptor
LigandBDBM50121343
Substrate/Competitorn/a
Meas. Tech.ChEMBL_1522245 (CHEMBL3626474)
Ki 930±n/a nM
Citation Stucchi, MGmeiner, PHuebner, HRainoldi, GSacchetti, ASilvani, ALesma, G Multicomponent Synthesis and Biological Evaluation of a Piperazine-Based Dopamine Receptor Ligand Library. ACS Med Chem Lett6:882-7 (2015) 
 
D(3) dopamine receptor
Name:D(3) dopamine receptor
Type:n/a
Mol. Mass.:44243.43
Organism:Homo sapiens (Human)
Description:n/a
Residue:400
BDBM50121343
NameBDBM50121343
Synonyms:CHEMBL3622103
TypeSmall organic molecule
Emp. Form.C25H33BrN4
Mol. Mass.469.46
SMILESCCCN(CCN1CCN(Cc2cc3ccccc3[nH]2)CC1)Cc1ccc(Br)cc1