Reaction Details
TargetOrnithine aminotransferase, mitochondrial
LigandBDBM50121376
Substrate/Competitorn/a
Meas. Tech.ChEMBL_1522254 (CHEMBL3626483)
Ki 2.1±n/a nM
Citation Zigmond, EBen Ya'acov, ALee, HLichtenstein, YShalev, ZSmith, YZolotarov, LZiv, EKalman, RLe, HVLu, HSilverman, RBIlan, Y Suppression of Hepatocellular Carcinoma by Inhibition of Overexpressed Ornithine Aminotransferase. ACS Med Chem Lett6:840-4 (2015) 
 
Ornithine aminotransferase, mitochondrial
Name:Ornithine aminotransferase, mitochondrial
Type:PROTEIN
Mol. Mass.:48537.27
Organism:Homo sapiens (Human)
Description:ChEMBL_102740
Residue:439
BDBM50121376
NameBDBM50121376
Synonyms:GABACULINE
TypeSmall organic molecule
Emp. Form.C7H11NO2
Mol. Mass.141.1677
SMILESN[C@@H]1CCCC(=C1)C(O)=O