Reaction Details
TargetTyrosine-protein kinase JAK2
LigandBDBM50121379
Substrate/Competitorn/a
Meas. Tech.ChEMBL_1518799 (CHEMBL3625473)
IC50 1.4±n/a nM
Citation Hart, ACSchroeder, GMWan, HGrebinski, JInghrim, JKempson, JGuo, JPitts, WJTokarski, JSSack, JSKhan, JALippy, JLorenzi, MVYou, DMcDevitt, TVuppugalla, RZhang, YLombardo, LJTrainor, GLPurandare, AV Structure-Based Design of Selective Janus Kinase 2 Imidazo[4,5-d]pyrrolo[2,3-b]pyridine Inhibitors. ACS Med Chem Lett6:845-9 (2015) 
 
Tyrosine-protein kinase JAK2
Name:Tyrosine-protein kinase JAK2
Type:Protein
Mol. Mass.:130684.68
Organism:Homo sapiens (Human)
Description:O60674
Residue:1132
BDBM50121379
NameBDBM50121379
Synonyms:CHEMBL3622134
TypeSmall organic molecule
Emp. Form.C21H23N7OS
Mol. Mass.421.519
SMILESCCn1c(cc2c1nc(Nc1nccs1)c1ncn(C)c21)C(=O)N(C1CC1)C1CC1