Reaction Details
TargetMetabotropic glutamate receptor 2
LigandBDBM50121652
Substrate/Competitorn/a
Meas. Tech.ChEMBL_1518588 (CHEMBL3619271)
EC50 4.5±n/a nM
Citation Monn, JAPrieto, LTaboada, LHao, JReinhard, MRHenry, SSBeadle, CDWalton, LMan, TRudyk, HClark, BTupper, DBaker, SRLamas, CMontero, CMarcos, ABlanco, JBures, MClawson, DKAtwell, SLu, FWang, JRussell, MHeinz, BAWang, XCarter, JHGetman, BGCatlow, JTSwanson, SJohnson, BGShaw, DBMcKinzie, DL Synthesis and Pharmacological Characterization of C4-(Thiotriazolyl)-substituted-2-aminobicyclo[3.1.0]hexane-2,6-dicarboxylates. Identification of (1R,2S,4R,5R,6R)-2-Amino-4-(1H-1,2,4-triazol-3-ylsulfanyl)bicyclo[3.1.0]hexane-2,6-dicarboxylic Acid (LY2812223), a Highly Potent, Functionally Selective J Med Chem58:7526-48 (2015) 
 
Metabotropic glutamate receptor 2
Name:Metabotropic glutamate receptor 2
Type:Enzyme
Mol. Mass.:95584.88
Organism:Homo sapiens (Human)
Description:Q14416
Residue:872
BDBM50121652
NameBDBM50121652
Synonyms:CHEMBL3616851
TypeSmall organic molecule
Emp. Form.C10H13N5O4S
Mol. Mass.299.306
SMILES[H][C@]12[C@H](C(O)=O)[C@@]1([H])[C@@](N)(C[C@H]2Sc1nnc(N)[nH]1)C(O)=O