Reaction Details
TargetMetabotropic glutamate receptor 8
LigandBDBM50121643
Substrate/Competitorn/a
Meas. Tech.ChEMBL_1518616 (CHEMBL3619431)
IC50>12500±n/a nM
Citation Monn, JAPrieto, LTaboada, LHao, JReinhard, MRHenry, SSBeadle, CDWalton, LMan, TRudyk, HClark, BTupper, DBaker, SRLamas, CMontero, CMarcos, ABlanco, JBures, MClawson, DKAtwell, SLu, FWang, JRussell, MHeinz, BAWang, XCarter, JHGetman, BGCatlow, JTSwanson, SJohnson, BGShaw, DBMcKinzie, DL Synthesis and Pharmacological Characterization of C4-(Thiotriazolyl)-substituted-2-aminobicyclo[3.1.0]hexane-2,6-dicarboxylates. Identification of (1R,2S,4R,5R,6R)-2-Amino-4-(1H-1,2,4-triazol-3-ylsulfanyl)bicyclo[3.1.0]hexane-2,6-dicarboxylic Acid (LY2812223), a Highly Potent, Functionally Selective J Med Chem58:7526-48 (2015) 
 
Metabotropic glutamate receptor 8
Name:Metabotropic glutamate receptor 8
Type:Enzyme Catalytic Domain
Mol. Mass.:101759.58
Organism:Homo sapiens (Human)
Description:metabotropic glutamate 8 GRM8 HUMAN::O00222
Residue:908
BDBM50121643
NameBDBM50121643
Synonyms:CHEMBL3616847
TypeSmall organic molecule
Emp. Form.C10H12N4O4S
Mol. Mass.284.292
SMILES[H][C@]12[C@H](C(O)=O)[C@@]1([H])[C@@](N)(C[C@H]2Sc1nnc[nH]1)C(O)=O