Reaction Details
TargetSerine/threonine-protein kinase B-raf
LigandBDBM50121690
Substrate/Competitorn/a
Meas. Tech.ChEMBL_1516562 (CHEMBL3620018)
IC50 5960±n/a nM
Citation Im, DJung, KYang, SAman, WHah, JM Discovery of 4-arylamido 3-methyl isoxazole derivatives as novel FMS kinase inhibitors. Eur J Med Chem102:600-10 (2015) 
 
Serine/threonine-protein kinase B-raf
Name:Serine/threonine-protein kinase B-raf
Type:Serine/threonine-protein kinase
Mol. Mass.:84446.00
Organism:Homo sapiens (Human)
Description:P15056
Residue:766
BDBM50121690
NameBDBM50121690
Synonyms:CHEMBL3616960
TypeSmall organic molecule
Emp. Form.C25H26F3N5O3
Mol. Mass.501.5008
SMILESCN1CCN(CC1)c1cc(cc(c1)C(F)(F)F)C(=O)Nc1ccc(C)c(NC(=O)c2cnoc2C)c1