Reaction Details
TargetMacrophage colony-stimulating factor 1 receptor
LigandBDBM50121690
Substrate/Competitorn/a
Meas. Tech.ChEMBL_1516574 (CHEMBL3620030)
IC50 10.0±n/a nM
Citation Im, DJung, KYang, SAman, WHah, JM Discovery of 4-arylamido 3-methyl isoxazole derivatives as novel FMS kinase inhibitors. Eur J Med Chem102:600-10 (2015) 
 
Macrophage colony-stimulating factor 1 receptor
Name:Macrophage colony-stimulating factor 1 receptor
Type:Protein
Mol. Mass.:107979.48
Organism:Homo sapiens (Human)
Description:P07333
Residue:972
BDBM50121690
NameBDBM50121690
Synonyms:CHEMBL3616960
TypeSmall organic molecule
Emp. Form.C25H26F3N5O3
Mol. Mass.501.5008
SMILESCN1CCN(CC1)c1cc(cc(c1)C(F)(F)F)C(=O)Nc1ccc(C)c(NC(=O)c2cnoc2C)c1