Reaction Details
TargetDeoxyribonuclease-1
LigandBDBM50121699
Substrate/Competitorn/a
Meas. Tech.ChEMBL_1516649 (CHEMBL3620429)
IC50>100000±n/a nM
Citation Chapman, TMGillen, KJWallace, CLee, MTBakrania, PKhurana, PCoombs, PJStennett, LFox, SBureau, EABrownlees, JMelton, DWSaxty, B Catechols and 3-hydroxypyridones as inhibitors of the DNA repair complex ERCC1-XPF. Bioorg Med Chem Lett25:4097-103 (2015) 
 
Deoxyribonuclease-1
Name:Deoxyribonuclease-1
Type:PROTEIN
Mol. Mass.:31422.78
Organism:Homo sapiens (Human)
Description:ChEMBL_109543
Residue:282
BDBM50121699
NameBDBM50121699
Synonyms:CHEMBL3616998
TypeSmall organic molecule
Emp. Form.C14H13NO3
Mol. Mass.243.2579
SMILESOc1ccc(CNC(=O)c2ccccc2)cc1O