Reaction Details
TargetFlap endonuclease 1
LigandBDBM50121861
Substrate/Competitorn/a
Meas. Tech.ChEMBL_1517026 (CHEMBL3619485)
IC50 630±n/a nM
Citation Chapman, TMWallace, CGillen, KJBakrania, PKhurana, PCoombs, PJFox, SBureau, EABrownlees, JMelton, DWSaxty, B N-Hydroxyimides and hydroxypyrimidinones as inhibitors of the DNA repair complex ERCC1-XPF. Bioorg Med Chem Lett25:4104-8 (2015) 
 
Flap endonuclease 1
Name:Flap endonuclease 1
Type:PROTEIN
Mol. Mass.:42602.57
Organism:Homo sapiens (Human)
Description:ChEMBL_1517026
Residue:380
BDBM50121861
NameBDBM50121861
Synonyms:CHEMBL3617203
TypeSmall organic molecule
Emp. Form.C10H8N2O3
Mol. Mass.204.1821
SMILESOn1c(=O)cc([nH]c1=O)-c1ccccc1