Reaction Details
TargetFlap endonuclease 1
LigandBDBM50121863
Substrate/Competitorn/a
Meas. Tech.ChEMBL_1517026 (CHEMBL3619485)
IC50 2000±n/a nM
Citation Chapman, TMWallace, CGillen, KJBakrania, PKhurana, PCoombs, PJFox, SBureau, EABrownlees, JMelton, DWSaxty, B N-Hydroxyimides and hydroxypyrimidinones as inhibitors of the DNA repair complex ERCC1-XPF. Bioorg Med Chem Lett25:4104-8 (2015) 
 
Flap endonuclease 1
Name:Flap endonuclease 1
Type:PROTEIN
Mol. Mass.:42602.57
Organism:Homo sapiens (Human)
Description:ChEMBL_1517026
Residue:380
BDBM50121863
NameBDBM50121863
Synonyms:CHEMBL3617201
TypeSmall organic molecule
Emp. Form.C10H9N3O4
Mol. Mass.235.1962
SMILESCC(=O)Nc1ccc2[nH]c(=O)n(O)c(=O)c2c1