Reaction Details
TargetFlap endonuclease 1
LigandBDBM50157850
Substrate/Competitorn/a
Meas. Tech.ChEMBL_1517026 (CHEMBL3619485)
IC50 680±n/a nM
Citation Chapman, TMWallace, CGillen, KJBakrania, PKhurana, PCoombs, PJFox, SBureau, EABrownlees, JMelton, DWSaxty, B N-Hydroxyimides and hydroxypyrimidinones as inhibitors of the DNA repair complex ERCC1-XPF. Bioorg Med Chem Lett25:4104-8 (2015) 
 
Flap endonuclease 1
Name:Flap endonuclease 1
Type:PROTEIN
Mol. Mass.:42602.57
Organism:Homo sapiens (Human)
Description:ChEMBL_1517026
Residue:380
BDBM50157850
NameBDBM50157850
Synonyms:3-Hydroxy-1-phenyl-1H-thieno[2,3-d]pyrimidine-2,4-dione | CHEMBL182974
TypeSmall organic molecule
Emp. Form.C13H10N2O3S
Mol. Mass.274.295
SMILESOn1c(=O)n(Cc2ccccc2)c2sccc2c1=O