Reaction Details
TargetFlap endonuclease 1
LigandBDBM50121879
Substrate/Competitorn/a
Meas. Tech.ChEMBL_1517026 (CHEMBL3619485)
IC50 10500±n/a nM
Citation Chapman, TMWallace, CGillen, KJBakrania, PKhurana, PCoombs, PJFox, SBureau, EABrownlees, JMelton, DWSaxty, B N-Hydroxyimides and hydroxypyrimidinones as inhibitors of the DNA repair complex ERCC1-XPF. Bioorg Med Chem Lett25:4104-8 (2015) 
 
Flap endonuclease 1
Name:Flap endonuclease 1
Type:PROTEIN
Mol. Mass.:42602.57
Organism:Homo sapiens (Human)
Description:ChEMBL_1517026
Residue:380
BDBM50121879
NameBDBM50121879
Synonyms:CHEMBL3617283
TypeSmall organic molecule
Emp. Form.C15H10FN3O3S
Mol. Mass.331.322
SMILESOc1c(nc([nH]c1=O)-c1cccs1)C(=O)Nc1ccc(F)cc1